khusamov
@khusamov
ReactJS, NodeJS, TypeScript, Sencha ExtJS

Как исправить ошибку :transformClassesWithDexForDebug com/android/dx/command/Main: Unsupported major.minor version 52.0?

Здравствуйте!
Я пытаюсь запустить тестовое приложение под Ionic (Cordova).

Делаю по инструкции ionicframework.com/getting-started
Застрял на последнем шаге на команде ionic build android

Все что нужно было до этого сделать я сделал.
В частности было сделано все по инструкции cordova.apache.org/docs/en/latest/guide/platforms/...

Сейчас по команде ionic build android
я получаю следующие ошибки:

C:\Users\khusamov\Documents\temp\myApp>ionic build android

Running command: "C:\Program Files\nodejs\node.exe"
C:\Users\khusamov\Documents\temp\myApp\hooks\after_prepare\010_add_platform_class.js
C:\Users\khusamov\Documents\temp\myApp
add to body class: platform-android
ANDROID_HOME=C:\Users\khusamov\AppData\Local\Android\android-sdk
JAVA_HOME=C:\Program Files\Java\jdk1.7.0_80

:preBuild UP-TO-DATE
:preDebugBuild UP-TO-DATE
:checkDebugManifest
:CordovaLib:preBuild UP-TO-DATE
:CordovaLib:preDebugBuild UP-TO-DATE
:CordovaLib:compileDebugNdk UP-TO-DATE
:CordovaLib:compileLint
:CordovaLib:copyDebugLint UP-TO-DATE
:CordovaLib:mergeDebugProguardFiles UP-TO-DATE
:CordovaLib:packageDebugRenderscript UP-TO-DATE
:CordovaLib:checkDebugManifest
:CordovaLib:prepareDebugDependencies
:CordovaLib:compileDebugRenderscript UP-TO-DATE
:CordovaLib:generateDebugResValues UP-TO-DATE
:CordovaLib:generateDebugResources UP-TO-DATE
:CordovaLib:packageDebugResources UP-TO-DATE
:CordovaLib:compileDebugAidl UP-TO-DATE
:CordovaLib:generateDebugBuildConfig UP-TO-DATE
:CordovaLib:generateDebugAssets UP-TO-DATE
:CordovaLib:mergeDebugAssets UP-TO-DATE
:CordovaLib:processDebugManifest UP-TO-DATE
:CordovaLib:processDebugResources UP-TO-DATE
:CordovaLib:generateDebugSources UP-TO-DATE
:CordovaLib:compileDebugJavaWithJavac UP-TO-DATE
:CordovaLib:processDebugJavaRes UP-TO-DATE
:CordovaLib:transformResourcesWithMergeJavaResForDebug UP-TO-DATE
:CordovaLib:transformClassesAndResourcesWithSyncLibJarsForDebug UP-TO-DATE
:CordovaLib:mergeDebugJniLibFolders UP-TO-DATE
:CordovaLib:transformNative_libsWithMergeJniLibsForDebug UP-TO-DATE
:CordovaLib:transformNative_libsWithSyncJniLibsForDebug UP-TO-DATE
:CordovaLib:bundleDebug UP-TO-DATE
:prepareAndroidCordovaLibUnspecifiedDebugLibrary UP-TO-DATE
:prepareDebugDependencies
:compileDebugAidl UP-TO-DATE
:compileDebugRenderscript UP-TO-DATE
:generateDebugBuildConfig UP-TO-DATE
:generateDebugAssets UP-TO-DATE
:mergeDebugAssets UP-TO-DATE
:generateDebugResValues UP-TO-DATE
:generateDebugResources UP-TO-DATE
:mergeDebugResources UP-TO-DATE
:processDebugManifest UP-TO-DATE
:processDebugResources UP-TO-DATE
:generateDebugSources UP-TO-DATE
:compileDebugJavaWithJavac UP-TO-DATE
:compileDebugNdk UP-TO-DATE
:compileDebugSources UP-TO-DATE

:transformClassesWithDexForDebug
java.lang.UnsupportedClassVersionError: com/android/dx/command/Main : 
Unsupported major.minor version 52.0

 FAILED
        at java.lang.ClassLoader.defineClass1(Native Method)
        at java.lang.ClassLoader.defineClass(ClassLoader.java:800)
        at java.security.SecureClassLoader.defineClass(SecureClassLoader.java:142)
        at java.net.URLClassLoader.defineClass(URLClassLoader.java:449)
        at java.net.URLClassLoader.access$100(URLClassLoader.java:71)
        at java.net.URLClassLoader$1.run(URLClassLoader.java:361)
        at java.net.URLClassLoader$1.run(URLClassLoader.java:355)
        at java.security.AccessController.doPrivileged(Native Method)
        at java.net.URLClassLoader.findClass(URLClassLoader.java:354)
        at java.lang.ClassLoader.loadClass(ClassLoader.java:425)
        at sun.misc.Launcher$AppClassLoader.loadClass(Launcher.java:308)
        at java.lang.ClassLoader.loadClass(ClassLoader.java:358)
        at sun.launcher.LauncherHelper.checkAndLoadMain(LauncherHelper.java:482)
Exception in thread "main"

FAILURE: Build failed with an exception.

* What went wrong:
Execution failed for task ':transformClassesWithDexForDebug'.
> com.android.ide.common.process.ProcessException: org.gradle.process.internal.ExecException: 
Process 'command 'C:\Program Files\Java\jdk1.7.0_80\bin\java.exe'' 
finished with non-zero exit value 1

* Try:
Run with --stacktrace option to get the stack trace. 
Run with --info or --debug option to get more log output.

BUILD FAILED

Total time: 31.101 secs
Error: Error code 1 for command: cmd with args: 
/s,/c,"C:\Users\khusamov\Documents\temp\myApp\platforms\android\gradlew 
cdvBuildDebug -b C:\Users\khusamov\Documents\temp\myApp\platforms\android\build.gradle 
-Dorg.gradle.daemon=true -Pandroid.useDeprecatedNdk=true"


Как исправить ошибку?

fd084d9828fe4ada908d52355b77627d.PNG
  • Вопрос задан
  • 6521 просмотр
Решения вопроса 1
khusamov
@khusamov Автор вопроса
ReactJS, NodeJS, TypeScript, Sencha ExtJS
Нашел ответ
wiki.iphoster.ru/wiki/Java_-_Unsupported_major.min...

Java - Unsupported major.minor version 52.0 - Что это значит?
Ошибка "Unsupported major.minor version 52.0" означает что приложение было скомпилированы на версии Java 8 и не будет работать на версиях ниже.

Установить последнюю версию можно по адресу
www.oracle.com/technetwork/java/javase/downloads/j...
не путать с JRE, нужна именно JDK версии 8
Ответ написан
Комментировать
Пригласить эксперта
Ваш ответ на вопрос

Войдите, чтобы написать ответ

Войти через центр авторизации
Похожие вопросы