Как исправить ошибку запуска проекта на Android Studio?

Уже неделю как пытаюсь настроить рабочую среду для изучения Flutter на vs код. На данный момент имею ошибку при запуске приложения на эмуляторе android студия
код ошибки
Launching lib\main.dart on sdk gphone x86 arm in debug mode...
Running Gradle task 'assembleDebug'...

FAILURE: Build failed with an exception.

* What went wrong:
Could not open settings generic class cache for settings file 'C:\Users\emin313\ones\android\settings.gradle' (C:\Users\emin313\.gradle\caches\6.7\scripts\1fnwrr8g4rohfp291nvlxj5qe).
> BUG! exception in phase 'semantic analysis' in source unit '_BuildScript_' Unsupported class file major version 60

* Try:
Run with --stacktrace option to get the stack trace. Run with --info or --debug option to get more log output. Run with --scan to get full insights.

* Get more help at https://help.gradle.org

BUILD FAILED in 11s
Exception: Gradle task assembleDebug failed with exit code 1
  • Вопрос задан
  • 115 просмотров
Пригласить эксперта
Ответы на вопрос 1
@prince_pagani
студен-программист
я никак не мог его решить пришлось сносить студио и данные и переустановить
Ответ написан
Ваш ответ на вопрос

Войдите, чтобы написать ответ

Войти через центр авторизации
Похожие вопросы