PingWins
@PingWins
Начинающий, а может и нет Python программист

Из за чего возникает данная ошибка?

Добрый день, устанваливаю (собираю) OpenCV себе на raspberry и примерно на 84% он выдает мне вот такую ошибку:
make[2]: *** [modules/python3/CMakeFiles/opencv_python3.dir/build.make:63: modules/python3/CMakeFiles/opencv_python3.dir/__/src2/cv2.cpp.o] Error 1
make[1]: *** [CMakeFiles/Makefile2:22191: modules/python3/CMakeFiles/opencv_python3.dir/all] Error 2
make: *** [Makefile:163: all] Error 2

Гуглил, но ничего дельного не нашел (возможно гуглил плохо).
При сборке (cmake) использовал следующие параметры:
cmake -D CMAKE_BUILD_TYPE=RELEASE \
          -D CMAKE_INSTALL_PREFIX="$PREFIX" \
          -D INSTALL_C_EXMAPLES=OFF \
          -D INSTALL_PYTHON_EXAMPLES=ON \
          -D OPENCV_EXTRA_MODULES_PATH=/home/pi/opencv/"$OPENCV_CONTRIB_PACKAGE_NAME"/modules \
          -D BUILD_EXAMPLES=ON \
          -D BUILD_DOCS=ON \
          -D ENABLE_NEON=ON \

Ошибка происходит при make -j4
  • Вопрос задан
  • 104 просмотра
Пригласить эксперта
Ответы на вопрос 1
@Toxic-cloud
Среднюю сложность можно и не выставлять, просто нет разрешения на комманду

Запускай с sudo, кста тоже вчера opencv ставил

И можешь ещё с одной проблемой столкнуться
В параметре OPENCV_EXTRA_PATH= путь до модулей, то есть та бибиотека которую ты скачал вместе с основной
Ответ написан
Ваш ответ на вопрос

Войдите, чтобы написать ответ

Войти через центр авторизации
Похожие вопросы