@nihi1ist

В чем проблема сборки пакета window-buttons для Ubuntu 19.04?

Пытаюсь собрать пакет - Window buttons, вер. 0.8. При сборке получаю ошибку:
ake[3]: *** [libappletdecoration/CMakeFiles/appletdecorationplugin.dir/build.make:183: libappletdecoration/CMakeFiles/appletdecorationplugin.dir/previewbridge.cpp.o] Ошибка 1
make[3]: *** Ожидание завершения заданий…
cd /home/nihi1ist/.src/window-buttons/0.8/plasma-applet-window-buttons-0.8.0/obj-x86_64-linux-gnu/libappletdecoration && /usr/bin/c++  -DKCOREADDONS_LIB -DQT_CORE_LIB -DQT_DBUS_LIB -DQT_GUI_LIB -DQT_NETWORK_LIB -DQT_NO_DEBUG -DQT_QML_LIB -DQT_QUICK_LIB -DQT_WIDGETS_LIB -DQT_XML_LIB -D_GNU_SOURCE -D_LARGEFILE64_SOURCE -Dappletdecorationplugin_EXPORTS -I/home/nihi1ist/.src/window-buttons/0.8/plasma-applet-window-buttons-0.8.0/obj-x86_64-linux-gnu/libappletdecoration -I/home/nihi1ist/.src/window-buttons/0.8/plasma-applet-window-buttons-0.8.0/libappletdecoration -I/home/nihi1ist/.src/window-buttons/0.8/plasma-applet-window-buttons-0.8.0/obj-x86_64-linux-gnu/libappletdecoration/appletdecorationplugin_autogen/include -isystem /usr/include/x86_64-linux-gnu/qt5 -isystem /usr/include/x86_64-linux-gnu/qt5/QtCore -isystem /usr/lib/x86_64-linux-gnu/qt5/mkspecs/linux-g++ -isystem /usr/include/x86_64-linux-gnu/qt5/QtDBus -isystem /usr/include/x86_64-linux-gnu/qt5/QtWidgets -isystem /usr/include/x86_64-linux-gnu/qt5/QtGui -isystem /usr/include/x86_64-linux-gnu/qt5/QtQuick -isystem /usr/include/x86_64-linux-gnu/qt5/QtQml -isystem /usr/include/x86_64-linux-gnu/qt5/QtNetwork -isystem /usr/include/KF5/KConfigWidgets -isystem /usr/include/KF5 -isystem /usr/include/KF5/KCodecs -isystem /usr/include/KF5/KWidgetsAddons -isystem /usr/include/KF5/KConfigGui -isystem /usr/include/x86_64-linux-gnu/qt5/QtXml -isystem /usr/include/KF5/KConfigCore -isystem /usr/include/KF5/KAuth -isystem /usr/include/KF5/KCoreAddons -isystem /usr/include/KF5/KI18n -isystem /usr/include/KF5/Plasma -isystem /usr/include/KF5/KService -isystem /usr/include/KF5/KPackage -isystem /usr/include/KF5/KWindowSystem -isystem /usr/include/KDecoration2  -g -O2 -fdebug-prefix-map=/home/nihi1ist/.src/window-buttons/0.8/plasma-applet-window-buttons-0.8.0=. -fstack-protector-strong -Wformat -Werror=format-security -Wdate-time -D_FORTIFY_SOURCE=2 -fno-operator-names -fno-exceptions -Wall -Wextra -Wcast-align -Wchar-subscripts -Wformat-security -Wno-long-long -Wpointer-arith -Wundef -Wnon-virtual-dtor -Woverloaded-virtual -Werror=return-type -Wvla -Wdate-time -Wsuggest-override -Wlogical-op -fPIC -fvisibility=hidden -fvisibility-inlines-hidden   -fPIC -std=gnu++14 -o CMakeFiles/appletdecorationplugin.dir/types.cpp.o -c /home/nihi1ist/.src/window-buttons/0.8/plasma-applet-window-buttons-0.8.0/libappletdecoration/types.cpp
make[3]: выход из каталога «/home/nihi1ist/.src/window-buttons/0.8/plasma-applet-window-buttons-0.8.0/obj-x86_64-linux-gnu»
make[2]: *** [CMakeFiles/Makefile2:521: libappletdecoration/CMakeFiles/appletdecorationplugin.dir/all] Ошибка 2
make[2]: выход из каталога «/home/nihi1ist/.src/window-buttons/0.8/plasma-applet-window-buttons-0.8.0/obj-x86_64-linux-gnu»
make[1]: *** [Makefile:144: all] Ошибка 2
make[1]: выход из каталога «/home/nihi1ist/.src/window-buttons/0.8/plasma-applet-window-buttons-0.8.0/obj-x86_64-linux-gnu»
dh_auto_build: cd obj-x86_64-linux-gnu && make -j12 "INSTALL=install --strip-program=true" returned exit code 2
make: *** [debian/rules:7: build] Ошибка 255


При этом пакет версиии 0.7 собирался без проблем.
  • Вопрос задан
  • 54 просмотра
Решения вопроса 1
@nihi1ist Автор вопроса
Разработчик всё поправил. Так то на себя грешил.
Ответ написан
Пригласить эксперта
Ваш ответ на вопрос

Войдите, чтобы написать ответ

Войти через центр авторизации
Похожие вопросы
ProfitClicks Краснодар
от 80 000 ₽
Абсолют Банк Москва
от 150 000 до 170 000 ₽
MSP360 Санкт-Петербург
от 80 000 до 130 000 ₽
30 мар. 2020, в 20:26
25000 руб./за проект
30 мар. 2020, в 20:22
25000 руб./за проект
30 мар. 2020, в 19:06
500 руб./за проект