Как исправить ошибку code 1 при установки node_modules?

Здравие желаю !

Пытаюсь установить node_modules, а он мне пишет и так каждый раз, когда я пытаюсь установить пакет с помощью npm

npm ERR! code 1
npm ERR! path C:\layout\gulp\node_modules\node-sass
npm ERR! command failed
npm ERR! command C:\Windows\system32\cmd.exe /d /s /c node scripts/build.js
npm ERR! Building: C:\node\node.exe C:\layout\gulp\node_modules\node-gyp\bin\node-gyp.js rebuild --verbose --libsass_ext= --libsass_cflags= --libsass_ldflags= --libsass_library=
npm ERR! gyp info it worked if it ends with ok
npm ERR! gyp verb cli [
npm ERR! gyp verb cli   'C:\\node\\node.exe',
npm ERR! gyp verb cli   'C:\\layout\\gulp\\node_modules\\node-gyp\\bin\\node-gyp.js',
npm ERR! gyp verb cli   'rebuild',
npm ERR! gyp verb cli   '--verbose',
npm ERR! gyp verb cli   '--libsass_ext=',
npm ERR! gyp verb cli   '--libsass_cflags=',
npm ERR! gyp verb cli   '--libsass_ldflags=',
npm ERR! gyp verb cli   '--libsass_library='
npm ERR! gyp verb cli ]
npm ERR! gyp info using node-gyp@3.8.0
npm ERR! gyp info using node@15.11.0 | win32 | x64
npm ERR! gyp verb command rebuild []
npm ERR! gyp verb command clean []
npm ERR! gyp verb clean removing "build" directory
npm ERR! gyp verb command configure []
npm ERR! gyp verb check python checking for Python executable "python2" in the PATH
npm ERR! gyp verb `which` failed Error: not found: python2
npm ERR! gyp verb `which` failed     at getNotFoundError (C:\layout\gulp\node_modules\which\which.js:13:12)
npm ERR! gyp verb `which` failed     at F (C:\layout\gulp\node_modules\which\which.js:68:19)
npm ERR! gyp verb `which` failed     at E (C:\layout\gulp\node_modules\which\which.js:80:29)
npm ERR! gyp verb `which` failed     at C:\layout\gulp\node_modules\which\which.js:89:16
npm ERR! gyp verb `which` failed     at C:\layout\gulp\node_modules\isexe\index.js:42:5
npm ERR! gyp verb `which` failed     at C:\layout\gulp\node_modules\isexe\windows.js:36:5
npm ERR! gyp verb `which` failed     at FSReqCallback.oncomplete (node:fs:200:21)
npm ERR! gyp verb `which` failed  python2 Error: not found: python2
npm ERR! gyp verb `which` failed     at getNotFoundError (C:\layout\gulp\node_modules\which\which.js:13:12)
npm ERR! gyp verb `which` failed     at F (C:\layout\gulp\node_modules\which\which.js:68:19)
npm ERR! gyp verb `which` failed     at E (C:\layout\gulp\node_modules\which\which.js:80:29)
npm ERR! gyp verb `which` failed     at C:\layout\gulp\node_modules\which\which.js:89:16
npm ERR! gyp verb `which` failed     at C:\layout\gulp\node_modules\isexe\index.js:42:5
npm ERR! gyp verb `which` failed     at C:\layout\gulp\node_modules\isexe\windows.js:36:5
npm ERR! gyp verb `which` failed     at FSReqCallback.oncomplete (node:fs:200:21) {
npm ERR! gyp verb `which` failed   code: 'ENOENT'
npm ERR! gyp verb `which` failed }
npm ERR! gyp verb check python checking for Python executable "python" in the PATH
npm ERR! gyp verb `which` succeeded python C:\Users\ITS\AppData\Local\Programs\Python\Python39\python.EXE
npm ERR! gyp ERR! configure error
npm ERR! gyp ERR! stack Error: Command failed: C:\Users\ITS\AppData\Local\Programs\Python\Python39\python.EXE -c import sys; print "%s.%s.%s" % sys.version_info[:3];
npm ERR! gyp ERR! stack   File "<string>", line 1
npm ERR! gyp ERR! stack     import sys; print "%s.%s.%s" % sys.version_info[:3];
npm ERR! gyp ERR! stack                       ^
npm ERR! gyp ERR! stack SyntaxError: invalid syntax
npm ERR! gyp ERR! stack
npm ERR! gyp ERR! stack     at ChildProcess.exithandler (node:child_process:326:12)
npm ERR! gyp ERR! stack     at ChildProcess.emit (node:events:378:20)
npm ERR! gyp ERR! stack     at maybeClose (node:internal/child_process:1067:16)
npm ERR! gyp ERR! stack     at Process.ChildProcess._handle.onexit (node:internal/child_process:301:5)
npm ERR! gyp ERR! System Windows_NT 10.0.19042
npm ERR! gyp ERR! command "C:\\node\\node.exe" "C:\\layout\\gulp\\node_modules\\node-gyp\\bin\\node-gyp.js" "rebuild" "--verbose" "--libsass_ext=" "--libsass_cflags=" "--libsass_ldflags=" "--libsass_library="
npm ERR! gyp ERR! cwd C:\layout\gulp\node_modules\node-sass
npm ERR! gyp ERR! node -v v15.11.0
npm ERR! gyp ERR! node-gyp -v v3.8.0
npm ERR! gyp ERR! not ok
npm ERR! Build failed with error code: 1

npm ERR! A complete log of this run can be found in:
npm ERR!     C:\Users\ITS\AppData\Local\npm-cache\_logs\2021-05-06T12_25_34_787Z-debug.log


В stackoverflow посоветовали установить python
npm install --python=path to your python executable
Но не помогло

Любые мысли очень ценятся, заранее спасибо
  • Вопрос задан
  • 123 просмотра
Решения вопроса 1
notiv-nt
@notiv-nt
Как ваше ничего? Да, моё тоже
node-sass требует python для сборки, берите dart sass npm i sass
Ответ написан
Пригласить эксперта
Ваш ответ на вопрос

Войдите, чтобы написать ответ

Войти через центр авторизации
Похожие вопросы
17 июн. 2021, в 00:44
40000 руб./за проект
17 июн. 2021, в 00:12
100000 руб./за проект
17 июн. 2021, в 00:05
2000 руб./за проект