@Gekatrin

Из-за чего может возникать ошибка npm ERR! code ELIFECYCLE npm ERR! errno 1?

Run npm test
npm test
shell: /usr/bin/bash -e {0}

> cat-energy-22@ test /home/runner/work/1490317-cat-energy-22/1490317-cat-energy-22
> npm run editorconfig

> cat-energy-22@ editorconfig /home/runner/work/1490317-cat-energy-22/1490317-cat-energy-22
> editorconfig-cli

Using '.editorconfig' from: "/home/runner/work/1490317-cat-energy-22/1490317-cat-energy-22/.editorconfig"
Loaded GLOBs from '/home/runner/work/1490317-cat-energy-22/1490317-cat-energy-22/package.json': *.json,source/*.html

File: source/index.html
Warning: Expected an indentation at 6 instead of at 5. [warning]
npm ERR! code ELIFECYCLE
npm ERR! errno 1
npm ERR! cat-energy-22@ editorconfig: `editorconfig-cli`
npm ERR! Exit status 1
npm ERR!
npm ERR! Failed at the cat-energy-22@ editorconfig script.
npm ERR! This is probably not a problem with npm. There is likely additional logging output above.

npm ERR! A complete log of this run can be found in:
npm ERR! /home/runner/.npm/_logs/2021-04-09T22_35_47_555Z-debug.log
npm ERR! Test failed. See above for more details.
Error: Process completed with exit code 1.
  • Вопрос задан
  • 46 просмотров
Пригласить эксперта
Ваш ответ на вопрос

Войдите, чтобы написать ответ

Войти через центр авторизации
Похожие вопросы