@Oogarchenko

Npm test ругается Как исправить ошибку editorconfig?

λ npm test

> sedona-20@ test D:\learning\Sedona2
> npm run editorconfig && npm run stylelint

> sedona-20@ editorconfig D:\learning\Sedona2
> editorconfig-cli

Using '.editorconfig' from: "D:\learning\Sedona2\.editorconfig"
Loaded GLOBs from 'D:\learning\Sedona2\package.json': *.json,*.js,source/*.html,source/js/**/*.js,source/img/**/*.svg,source/less/**/*.less

File: source/less/hidden.less
Line: 1 Incorrect end of line character(s) found. [warning]
Line: 2 Incorrect end of line character(s) found. [warning]
Line: 3 Incorrect end of line character(s) found. [warning]
Line: 4 Incorrect end of line character(s) found. [warning]
Line: 5 Incorrect end of line character(s) found. [warning]
Line: 6 Incorrect end of line character(s) found. [warning]
Line: 7 Incorrect end of line character(s) found. [warning]
npm ERR! code ELIFECYCLE
npm ERR! errno 1
npm ERR! sedona-20@ editorconfig: `editorconfig-cli`
npm ERR! Exit status 1
npm ERR!
npm ERR! Failed at the sedona-20@ editorconfig script.
npm ERR! This is probably not a problem with npm. There is likely additional logging output above.

npm ERR! A complete log of this run can be found in:
npm ERR! C:\Users\V******n\AppData\Roaming\npm-cache\_logs\2020-08-05T12_11_31_809Z-debug.log
npm ERR! Test failed. See above for more details.
  • Вопрос задан
  • 70 просмотров
Пригласить эксперта
Ваш ответ на вопрос

Войдите, чтобы написать ответ

Войти через центр авторизации
Похожие вопросы
DATUM Soft Ростов-на-Дону
от 60 000 до 75 000 ₽
Яндекс Москва
от 100 000 до 300 000 ₽
Яндекс Санкт-Петербург
от 100 000 до 300 000 ₽
28 сент. 2020, в 00:10
15000 руб./за проект
27 сент. 2020, в 21:54
15000 руб./за проект