@tehfoxen

Не устанавливается модуль gulp-sass, что сделать?

Ошибка при установке модуля gulp-sass. Устанавливали модуль gyp, сносили и заново поставили node.js (в том числе пробовали разные версии).
Building: C:\Program Files\nodejs\node.exe C:\Users\ALECHI~1\Desktop\slider\node_modules\node-gyp\bin\node-gyp.js rebuild --verbose --libsass_ext= --libsass_cflags= --libsass_ldflags= --libsass_library=
gyp info it worked if it ends with ok
gyp verb cli [ 'C:\\Program Files\\nodejs\\node.exe',
gyp verb cli 'C:\\Users\\ALECHI~1\\Desktop\\slider\\node_modules\\node-gyp\\bin\\node-gyp.js',
gyp verb cli 'rebuild',
gyp verb cli '--verbose',
gyp verb cli '--libsass_ext=',
gyp verb cli '--libsass_cflags=',
gyp verb cli '--libsass_ldflags=',
gyp verb cli '--libsass_library=' ]
gyp info using node-gyp@3.8.0
gyp info using node@10.16.3 | win32 | x64
gyp verb command rebuild []
gyp verb command clean []
gyp verb clean removing "build" directory
gyp verb command configure []
gyp verb check python checking for Python executable "python2" in the PATH
gyp verb `which` failed Error: not found: python2
gyp verb `which` failed at getNotFoundError (C:\Users\ALECHI~1\Desktop\slider\node_modules\which\which.js:13:12)
gyp verb `which` failed at F (C:\Users\ALECHI~1\Desktop\slider\node_modules\which\which.js:68:19)
gyp verb `which` failed at E (C:\Users\ALECHI~1\Desktop\slider\node_modules\which\which.js:80:29)
gyp verb `which` failed at C:\Users\ALECHI~1\Desktop\slider\node_modules\which\which.js:89:16
gyp verb `which` failed at C:\Users\ALECHI~1\Desktop\slider\node_modules\isexe\index.js:42:5
gyp verb `which` failed at C:\Users\ALECHI~1\Desktop\slider\node_modules\isexe\windows.js:36:5
gyp verb `which` failed at FSReqWrap.oncomplete (fs.js:153:21)
gyp verb `which` failed python2 { Error: not found: python2
gyp verb `which` failed at getNotFoundError (C:\Users\ALECHI~1\Desktop\slider\node_modules\which\which.js:13:12)
gyp verb `which` failed at F (C:\Users\ALECHI~1\Desktop\slider\node_modules\which\which.js:68:19)
gyp verb `which` failed at E (C:\Users\ALECHI~1\Desktop\slider\node_modules\which\which.js:80:29)
gyp verb `which` failed at C:\Users\ALECHI~1\Desktop\slider\node_modules\which\which.js:89:16
gyp verb `which` failed at C:\Users\ALECHI~1\Desktop\slider\node_modules\isexe\index.js:42:5
gyp verb `which` failed at C:\Users\ALECHI~1\Desktop\slider\node_modules\isexe\windows.js:36:5
gyp verb `which` failed at FSReqWrap.oncomplete (fs.js:153:21)
gyp verb `which` failed stack:
gyp verb `which` failed 'Error: not found: python2\n at getNotFoundError (C:\\Users\\ALECHI~1\\Desktop\\slider\\node_modules\\which\\which.js:13:12)\n at F (C:\\Users\\ALECHI~1\\Desktop\\slider\\node_modules\\which\\which.js:68:19)\n at E (C:\\Users\\ALECHI~1\\Desktop\\slider\\node_modules\\which\\which.js:80:29)\n at C:\\Users\\ALECHI~1\\Desktop\\slider\\node_modules\\which\\which.js:89:16\n at C:\\Users\\ALECHI~1\\Desktop\\slider\\node_modules\\isexe\\index.js:42:5\n at C:\\Users\\ALECHI~1\\Desktop\\slider\\node_modules\\isexe\\windows.js:36:5\n at FSReqWrap.oncomplete (fs.js:153:21)',
gyp verb `which` failed code: 'ENOENT' }
gyp verb check python checking for Python executable "python" in the PATH
gyp verb `which` failed Error: not found: python
gyp verb `which` failed at getNotFoundError (C:\Users\ALECHI~1\Desktop\slider\node_modules\which\which.js:13:12)
gyp verb `which` failed at F (C:\Users\ALECHI~1\Desktop\slider\node_modules\which\which.js:68:19)
gyp verb `which` failed at E (C:\Users\ALECHI~1\Desktop\slider\node_modules\which\which.js:80:29)
gyp verb `which` failed at C:\Users\ALECHI~1\Desktop\slider\node_modules\which\which.js:89:16
gyp verb `which` failed at C:\Users\ALECHI~1\Desktop\slider\node_modules\isexe\index.js:42:5
gyp verb `which` failed at C:\Users\ALECHI~1\Desktop\slider\node_modules\isexe\windows.js:36:5
gyp verb `which` failed at FSReqWrap.oncomplete (fs.js:153:21)
gyp verb `which` failed python { Error: not found: python
gyp verb `which` failed at getNotFoundError (C:\Users\ALECHI~1\Desktop\slider\node_modules\which\which.js:13:12)
gyp verb `which` failed at F (C:\Users\ALECHI~1\Desktop\slider\node_modules\which\which.js:68:19)
gyp verb `which` failed at E (C:\Users\ALECHI~1\Desktop\slider\node_modules\which\which.js:80:29)
gyp verb `which` failed at C:\Users\ALECHI~1\Desktop\slider\node_modules\which\which.js:89:16
gyp verb `which` failed at C:\Users\ALECHI~1\Desktop\slider\node_modules\isexe\index.js:42:5
gyp verb `which` failed at C:\Users\ALECHI~1\Desktop\slider\node_modules\isexe\windows.js:36:5
gyp verb `which` failed at FSReqWrap.oncomplete (fs.js:153:21)
gyp verb `which` failed stack:
gyp verb `which` failed 'Error: not found: python\n at getNotFoundError (C:\\Users\\ALECHI~1\\Desktop\\slider\\node_modules\\which\\which.js:13:12)\n at F (C:\\Users\\ALECHI~1\\Desktop\\slider\\node_modules\\which\\which.js:68:19)\n at E (C:\\Users\\ALECHI~1\\Desktop\\slider\\node_modules\\which\\which.js:80:29)\n at C:\\Users\\ALECHI~1\\Desktop\\slider\\node_modules\\which\\which.js:89:16\n at C:\\Users\\ALECHI~1\\Desktop\\slider\\node_modules\\isexe\\index.js:42:5\n at C:\\Users\\ALECHI~1\\Desktop\\slider\\node_modules\\isexe\\windows.js:36:5\n at FSReqWrap.oncomplete (fs.js:153:21)',
gyp verb `which` failed code: 'ENOENT' }
gyp verb could not find "python". checking python launcher
gyp verb could not find "python". guessing location
gyp verb ensuring that file exists: C:\Python27\python.exe
gyp ERR! configure error
gyp ERR! stack Error: Can't find Python executable "python", you can set the PYTHON env variable.
gyp ERR! stack at PythonFinder.failNoPython (C:\Users\ALECHI~1\Desktop\slider\node_modules\node-gyp\lib\configure.js:484:19)
gyp ERR! stack at PythonFinder. (C:\Users\ALECHI~1\Desktop\slider\node_modules\node-gyp\lib\configure.js:509:16)
gyp ERR! stack at callback (C:\Users\ALECHI~1\Desktop\slider\node_modules\graceful-fs\polyfills.js:295:20)
gyp ERR! stack at FSReqWrap.oncomplete (fs.js:153:21)
gyp ERR! System Windows_NT 6.1.7601
gyp ERR! command "C:\\Program Files\\nodejs\\node.exe" "C:\\Users\\ALECHI~1\\Desktop\\slider\\node_modules\\node-gyp\\bin\\node-gyp.js" "rebuild" "--verbose" "--libsass_ext=" "--libsass_cflags=" "--libsass_ldflags=" "--libsass_library="
gyp ERR! cwd C:\Users\ALECHI~1\Desktop\slider\node_modules\node-sass
gyp ERR! node -v v10.16.3
gyp ERR! node-gyp -v v3.8.0
gyp ERR! not ok
Build failed with error code: 1
npm WARN slider@1.0.0 No description
npm WARN slider@1.0.0 No repository field.
npm WARN optional SKIPPING OPTIONAL DEPENDENCY: fsevents@1.2.9 (node_modules\fsevents):
npm WARN notsup SKIPPING OPTIONAL DEPENDENCY: Unsupported platform for fsevents@1.2.9: wanted {"os":"darwin","arch":"any"} (current: {"os":"win32","arch":"x64"})
npm WARN optional SKIPPING OPTIONAL DEPENDENCY: gifsicle@4.0.1 (node_modules\gifsicle):
npm WARN optional SKIPPING OPTIONAL DEPENDENCY: gifsicle@4.0.1 postinstall: `node lib/install.js`
npm WARN optional SKIPPING OPTIONAL DEPENDENCY: Exit status 1
npm WARN optional SKIPPING OPTIONAL DEPENDENCY: optipng-bin@6.0.0 (node_modules\optipng-bin):
npm WARN optional SKIPPING OPTIONAL DEPENDENCY: optipng-bin@6.0.0 postinstall: `node lib/install.js`
npm WARN optional SKIPPING OPTIONAL DEPENDENCY: Exit status 1

npm ERR! code ELIFECYCLE
npm ERR! errno 1
npm ERR! node-sass@4.12.0 postinstall: `node scripts/build.js`
npm ERR! Exit status 1
npm ERR!
npm ERR! Failed at the node-sass@4.12.0 postinstall script.
npm ERR! This is probably not a problem with npm. There is likely additional logging output above.

npm ERR! A complete log of this run can be found in:
npm ERR! C:\Users\alechina_tn\AppData\Roaming\npm-cache\_logs\2019-09-05T14_16_49_356Z-debug.log
  • Вопрос задан
  • 162 просмотра
Пригласить эксперта
Ваш ответ на вопрос

Войдите, чтобы написать ответ

Войти через центр авторизации
Похожие вопросы
06 апр. 2020, в 12:06
250 руб./за проект
06 апр. 2020, в 11:47
6000 руб./за проект
06 апр. 2020, в 11:37
2000 руб./за проект