@Chesterfield25

Как решить ошибку «FAILURE: Build failed with an exception»?

ОШИБКА: сбой при сборке.

FAILURE: Build failed with an exception.

* What went wrong:
Execution failed for task ':app:compileDebugJavaWithJavac'.
> Compilation failed; see the compiler error output for details.

* Try:
Run with --stacktrace option to get the stack trace. Run with --info or --debug option to get more log output. Run with --scan to get full insights.

* Get more help at https://help.gradle.org

BUILD FAILED in 7s
  • Вопрос задан
  • 59 просмотров
Пригласить эксперта
Ответы на вопрос 2
@Shroud228
Compilation failed; see the compiler error output for details.
Ответ написан
@402d
начинал с бейсика на УКНЦ в 1988
Dagger ? откуда у вас в коде собачка_Module ?
проверяйте, что и где забыли подключить по инструкции от того, что Вы используете.
Ответ написан
Ваш ответ на вопрос

Войдите, чтобы написать ответ

Войти через центр авторизации
Похожие вопросы